Determining if the system is big endian passed with the following output:
Change Dir: /home/john/build/CMakeFiles/CMakeTmp

Run Build Command:"/usr/bin/make" "cmTC_e47af/fast"
/usr/bin/make -f CMakeFiles/cmTC_e47af.dir/build.make CMakeFiles/cmTC_e47af.dir/build
make[1]: Entering directory '/home/john/build/CMakeFiles/CMakeTmp'
Building C object CMakeFiles/cmTC_e47af.dir/TestEndianess.c.o
/usr/bin/cc     -o CMakeFiles/cmTC_e47af.dir/TestEndianess.c.o   -c /home/john/build/CMakeFiles/CMakeTmp/TestEndianess.c
Linking C executable cmTC_e47af
/usr/bin/cmake -E cmake_link_script CMakeFiles/cmTC_e47af.dir/link.txt --verbose=1
/usr/bin/cc       CMakeFiles/cmTC_e47af.dir/TestEndianess.c.o  -o cmTC_e47af -rdynamic 
make[1]: Leaving directory '/home/john/build/CMakeFiles/CMakeTmp'

TestEndianess.c:
/* A 16 bit integer is required. */
typedef unsigned short cmakeint16;

/* On a little endian machine, these 16bit ints will give "THIS IS LITTLE ENDIAN."
   On a big endian machine the characters will be exchanged pairwise. */
const cmakeint16 info_little[] =  {0x4854, 0x5349, 0x4920, 0x2053, 0x494c, 0x5454, 0x454c, 0x4520, 0x444e, 0x4149, 0x2e4e, 0x0000};

/* on a big endian machine, these 16bit ints will give "THIS IS BIG ENDIAN."
   On a little endian machine the characters will be exchanged pairwise. */
const cmakeint16 info_big[] =     {0x5448, 0x4953, 0x2049, 0x5320, 0x4249, 0x4720, 0x454e, 0x4449, 0x414e, 0x2e2e, 0x0000};

#ifdef __CLASSIC_C__
int main(argc, argv) int argc; char *argv[];
#else
int main(int argc, char *argv[])
#endif
{
  int require = 0;
  require += info_little[argc];
  require += info_big[argc];
  (void)argv;
  return require;
}


Determining if the pthread_create exist failed with the following output:
Change Dir: /home/john/build/CMakeFiles/CMakeTmp

Run Build Command:"/usr/bin/make" "cmTC_8401f/fast"
/usr/bin/make -f CMakeFiles/cmTC_8401f.dir/build.make CMakeFiles/cmTC_8401f.dir/build
make[1]: Entering directory '/home/john/build/CMakeFiles/CMakeTmp'
Building C object CMakeFiles/cmTC_8401f.dir/CheckSymbolExists.c.o
/usr/bin/cc     -o CMakeFiles/cmTC_8401f.dir/CheckSymbolExists.c.o   -c /home/john/build/CMakeFiles/CMakeTmp/CheckSymbolExists.c
Linking C executable cmTC_8401f
/usr/bin/cmake -E cmake_link_script CMakeFiles/cmTC_8401f.dir/link.txt --verbose=1
/usr/bin/cc       CMakeFiles/cmTC_8401f.dir/CheckSymbolExists.c.o  -o cmTC_8401f -rdynamic 
CMakeFiles/cmTC_8401f.dir/CheckSymbolExists.c.o: In function `main':
CheckSymbolExists.c:(.text+0x16): undefined reference to `pthread_create'
collect2: error: ld returned 1 exit status
CMakeFiles/cmTC_8401f.dir/build.make:97: recipe for target 'cmTC_8401f' failed
make[1]: *** [cmTC_8401f] Error 1
make[1]: Leaving directory '/home/john/build/CMakeFiles/CMakeTmp'
Makefile:126: recipe for target 'cmTC_8401f/fast' failed
make: *** [cmTC_8401f/fast] Error 2

File /home/john/build/CMakeFiles/CMakeTmp/CheckSymbolExists.c:
/* */
#include <pthread.h>

int main(int argc, char** argv)
{
  (void)argv;
#ifndef pthread_create
  return ((int*)(&pthread_create))[argc];
#else
  (void)argc;
  return 0;
#endif
}

Determining if the function pthread_create exists in the pthreads failed with the following output:
Change Dir: /home/john/build/CMakeFiles/CMakeTmp

Run Build Command:"/usr/bin/make" "cmTC_99c53/fast"
/usr/bin/make -f CMakeFiles/cmTC_99c53.dir/build.make CMakeFiles/cmTC_99c53.dir/build
make[1]: Entering directory '/home/john/build/CMakeFiles/CMakeTmp'
Building C object CMakeFiles/cmTC_99c53.dir/CheckFunctionExists.c.o
/usr/bin/cc    -DCHECK_FUNCTION_EXISTS=pthread_create   -o CMakeFiles/cmTC_99c53.dir/CheckFunctionExists.c.o   -c /usr/share/cmake-3.5/Modules/CheckFunctionExists.c
Linking C executable cmTC_99c53
/usr/bin/cmake -E cmake_link_script CMakeFiles/cmTC_99c53.dir/link.txt --verbose=1
/usr/bin/cc   -DCHECK_FUNCTION_EXISTS=pthread_create    CMakeFiles/cmTC_99c53.dir/CheckFunctionExists.c.o  -o cmTC_99c53 -rdynamic -lpthreads 
/usr/bin/ld: cannot find -lpthreads
collect2: error: ld returned 1 exit status
CMakeFiles/cmTC_99c53.dir/build.make:97: recipe for target 'cmTC_99c53' failed
make[1]: *** [cmTC_99c53] Error 1
make[1]: Leaving directory '/home/john/build/CMakeFiles/CMakeTmp'
Makefile:126: recipe for target 'cmTC_99c53/fast' failed
make: *** [cmTC_99c53/fast] Error 2


Determining if files ieeefp.h exist failed with the following output:
Change Dir: /home/john/build/CMakeFiles/CMakeTmp

Run Build Command:"/usr/bin/make" "cmTC_a761b/fast"
/usr/bin/make -f CMakeFiles/cmTC_a761b.dir/build.make CMakeFiles/cmTC_a761b.dir/build
make[1]: Entering directory '/home/john/build/CMakeFiles/CMakeTmp'
Building C object CMakeFiles/cmTC_a761b.dir/CheckIncludeFiles.c.o
/usr/bin/cc     -o CMakeFiles/cmTC_a761b.dir/CheckIncludeFiles.c.o   -c /home/john/build/CMakeFiles/CMakeTmp/CheckIncludeFiles.c
/home/john/build/CMakeFiles/CMakeTmp/CheckIncludeFiles.c:2:20: fatal error: ieeefp.h: No such file or directory
compilation terminated.
CMakeFiles/cmTC_a761b.dir/build.make:65: recipe for target 'CMakeFiles/cmTC_a761b.dir/CheckIncludeFiles.c.o' failed
make[1]: *** [CMakeFiles/cmTC_a761b.dir/CheckIncludeFiles.c.o] Error 1
make[1]: Leaving directory '/home/john/build/CMakeFiles/CMakeTmp'
Makefile:126: recipe for target 'cmTC_a761b/fast' failed
make: *** [cmTC_a761b/fast] Error 2

Source:
/* */
#include <ieeefp.h>


int main(void){return 0;}

Determining size of struct stat64 failed with the following output:
Change Dir: /home/john/build/CMakeFiles/CMakeTmp

Run Build Command:"/usr/bin/make" "cmTC_f6faa/fast"
/usr/bin/make -f CMakeFiles/cmTC_f6faa.dir/build.make CMakeFiles/cmTC_f6faa.dir/build
make[1]: Entering directory '/home/john/build/CMakeFiles/CMakeTmp'
Building C object CMakeFiles/cmTC_f6faa.dir/CMTK_USE_STAT64.c.o
/usr/bin/cc     -o CMakeFiles/cmTC_f6faa.dir/CMTK_USE_STAT64.c.o   -c /home/john/build/CMakeFiles/CheckTypeSize/CMTK_USE_STAT64.c
/home/john/build/CMakeFiles/CheckTypeSize/CMTK_USE_STAT64.c:18:22: error: invalid application of ‘sizeof’ to incomplete type ‘struct stat64’
 #define SIZE (sizeof(struct stat64))
                      ^
/home/john/build/CMakeFiles/CheckTypeSize/CMTK_USE_STAT64.c:20:12: note: in expansion of macro ‘SIZE’
   ('0' + ((SIZE / 10000)%10)),
            ^
/home/john/build/CMakeFiles/CheckTypeSize/CMTK_USE_STAT64.c:18:22: error: invalid application of ‘sizeof’ to incomplete type ‘struct stat64’
 #define SIZE (sizeof(struct stat64))
                      ^
/home/john/build/CMakeFiles/CheckTypeSize/CMTK_USE_STAT64.c:21:12: note: in expansion of macro ‘SIZE’
   ('0' + ((SIZE / 1000)%10)),
            ^
/home/john/build/CMakeFiles/CheckTypeSize/CMTK_USE_STAT64.c:18:22: error: invalid application of ‘sizeof’ to incomplete type ‘struct stat64’
 #define SIZE (sizeof(struct stat64))
                      ^
/home/john/build/CMakeFiles/CheckTypeSize/CMTK_USE_STAT64.c:22:12: note: in expansion of macro ‘SIZE’
   ('0' + ((SIZE / 100)%10)),
            ^
/home/john/build/CMakeFiles/CheckTypeSize/CMTK_USE_STAT64.c:18:22: error: invalid application of ‘sizeof’ to incomplete type ‘struct stat64’
 #define SIZE (sizeof(struct stat64))
                      ^
/home/john/build/CMakeFiles/CheckTypeSize/CMTK_USE_STAT64.c:23:12: note: in expansion of macro ‘SIZE’
   ('0' + ((SIZE / 10)%10)),
            ^
/home/john/build/CMakeFiles/CheckTypeSize/CMTK_USE_STAT64.c:18:22: error: invalid application of ‘sizeof’ to incomplete type ‘struct stat64’
 #define SIZE (sizeof(struct stat64))
                      ^
/home/john/build/CMakeFiles/CheckTypeSize/CMTK_USE_STAT64.c:24:12: note: in expansion of macro ‘SIZE’
   ('0' +  (SIZE    % 10)),
            ^
CMakeFiles/cmTC_f6faa.dir/build.make:65: recipe for target 'CMakeFiles/cmTC_f6faa.dir/CMTK_USE_STAT64.c.o' failed
make[1]: *** [CMakeFiles/cmTC_f6faa.dir/CMTK_USE_STAT64.c.o] Error 1
make[1]: Leaving directory '/home/john/build/CMakeFiles/CMakeTmp'
Makefile:126: recipe for target 'cmTC_f6faa/fast' failed
make: *** [cmTC_f6faa/fast] Error 2

/home/john/build/CMakeFiles/CheckTypeSize/CMTK_USE_STAT64.c:
#include <sys/types.h>
#include <stdint.h>
#include <stddef.h>
#include "sys/stat.h"


#undef KEY
#if defined(__i386)
# define KEY '_','_','i','3','8','6'
#elif defined(__x86_64)
# define KEY '_','_','x','8','6','_','6','4'
#elif defined(__ppc__)
# define KEY '_','_','p','p','c','_','_'
#elif defined(__ppc64__)
# define KEY '_','_','p','p','c','6','4','_','_'
#endif

#define SIZE (sizeof(struct stat64))
char info_size[] =  {'I', 'N', 'F', 'O', ':', 's','i','z','e','[',
  ('0' + ((SIZE / 10000)%10)),
  ('0' + ((SIZE / 1000)%10)),
  ('0' + ((SIZE / 100)%10)),
  ('0' + ((SIZE / 10)%10)),
  ('0' +  (SIZE    % 10)),
  ']',
#ifdef KEY
  ' ','k','e','y','[', KEY, ']',
#endif
  '\0'};

#ifdef __CLASSIC_C__
int main(argc, argv) int argc; char *argv[];
#else
int main(int argc, char *argv[])
#endif
{
  int require = 0;
  require += info_size[argc];
  (void)argv;
  return require;
}


Determining if the system is big endian passed with the following output:
Change Dir: /home/john/build/CMakeFiles/CMakeTmp

Run Build Command:"/usr/bin/make" "cmTC_dd14b/fast"
/usr/bin/make -f CMakeFiles/cmTC_dd14b.dir/build.make CMakeFiles/cmTC_dd14b.dir/build
make[1]: Entering directory '/home/john/build/CMakeFiles/CMakeTmp'
Building C object CMakeFiles/cmTC_dd14b.dir/TestEndianess.c.o
/usr/bin/cc     -o CMakeFiles/cmTC_dd14b.dir/TestEndianess.c.o   -c /home/john/build/CMakeFiles/CMakeTmp/TestEndianess.c
Linking C executable cmTC_dd14b
/usr/bin/cmake -E cmake_link_script CMakeFiles/cmTC_dd14b.dir/link.txt --verbose=1
/usr/bin/cc       CMakeFiles/cmTC_dd14b.dir/TestEndianess.c.o  -o cmTC_dd14b -rdynamic 
make[1]: Leaving directory '/home/john/build/CMakeFiles/CMakeTmp'

TestEndianess.c:
/* A 16 bit integer is required. */
typedef unsigned short cmakeint16;

/* On a little endian machine, these 16bit ints will give "THIS IS LITTLE ENDIAN."
   On a big endian machine the characters will be exchanged pairwise. */
const cmakeint16 info_little[] =  {0x4854, 0x5349, 0x4920, 0x2053, 0x494c, 0x5454, 0x454c, 0x4520, 0x444e, 0x4149, 0x2e4e, 0x0000};

/* on a big endian machine, these 16bit ints will give "THIS IS BIG ENDIAN."
   On a little endian machine the characters will be exchanged pairwise. */
const cmakeint16 info_big[] =     {0x5448, 0x4953, 0x2049, 0x5320, 0x4249, 0x4720, 0x454e, 0x4449, 0x414e, 0x2e2e, 0x0000};

#ifdef __CLASSIC_C__
int main(argc, argv) int argc; char *argv[];
#else
int main(int argc, char *argv[])
#endif
{
  int require = 0;
  require += info_little[argc];
  require += info_big[argc];
  (void)argv;
  return require;
}


Value of the 22nd bit of a 32-bit quiet-NaN is 1TestQnanhibit.c produced following output:
Change Dir: /home/john/build/CMakeFiles/CMakeTmp

Run Build Command:"/usr/bin/make" "cmTC_29059/fast"
/usr/bin/make -f CMakeFiles/cmTC_29059.dir/build.make CMakeFiles/cmTC_29059.dir/build
make[1]: Entering directory '/home/john/build/CMakeFiles/CMakeTmp'
Building C object CMakeFiles/cmTC_29059.dir/TestQnanhibit.c.o
/usr/bin/cc     -o CMakeFiles/cmTC_29059.dir/TestQnanhibit.c.o   -c /home/john/cmtk-3.3.1/CMake/TestQnanhibit.c
Linking C executable cmTC_29059
/usr/bin/cmake -E cmake_link_script CMakeFiles/cmTC_29059.dir/link.txt --verbose=1
/usr/bin/cc       CMakeFiles/cmTC_29059.dir/TestQnanhibit.c.o  -o cmTC_29059 -rdynamic 
make[1]: Leaving directory '/home/john/build/CMakeFiles/CMakeTmp'
-DTEEM_QNANHIBIT=1


Determining if the include file unordered_map exists failed with the following output:
Change Dir: /home/john/build/CMakeFiles/CMakeTmp

Run Build Command:"/usr/bin/make" "cmTC_f0b21/fast"
/usr/bin/make -f CMakeFiles/cmTC_f0b21.dir/build.make CMakeFiles/cmTC_f0b21.dir/build
make[1]: Entering directory '/home/john/build/CMakeFiles/CMakeTmp'
Building CXX object CMakeFiles/cmTC_f0b21.dir/CheckIncludeFile.cxx.o
/usr/bin/c++      -o CMakeFiles/cmTC_f0b21.dir/CheckIncludeFile.cxx.o -c /home/john/build/CMakeFiles/CMakeTmp/CheckIncludeFile.cxx
In file included from /usr/include/c++/5/unordered_map:35:0,
                 from /home/john/build/CMakeFiles/CMakeTmp/CheckIncludeFile.cxx:1:
/usr/include/c++/5/bits/c++0x_warning.h:32:2: error: #error This file requires compiler and library support for the ISO C++ 2011 standard. This support must be enabled with the -std=c++11 or -std=gnu++11 compiler options.
 #error This file requires compiler and library support \
  ^
CMakeFiles/cmTC_f0b21.dir/build.make:65: recipe for target 'CMakeFiles/cmTC_f0b21.dir/CheckIncludeFile.cxx.o' failed
make[1]: *** [CMakeFiles/cmTC_f0b21.dir/CheckIncludeFile.cxx.o] Error 1
make[1]: Leaving directory '/home/john/build/CMakeFiles/CMakeTmp'
Makefile:126: recipe for target 'cmTC_f0b21/fast' failed
make: *** [cmTC_f0b21/fast] Error 2


Determining if files dispatch/dispatch.h exist failed with the following output:
Change Dir: /home/john/build/CMakeFiles/CMakeTmp

Run Build Command:"/usr/bin/make" "cmTC_72455/fast"
/usr/bin/make -f CMakeFiles/cmTC_72455.dir/build.make CMakeFiles/cmTC_72455.dir/build
make[1]: Entering directory '/home/john/build/CMakeFiles/CMakeTmp'
Building C object CMakeFiles/cmTC_72455.dir/CheckIncludeFiles.c.o
/usr/bin/cc     -o CMakeFiles/cmTC_72455.dir/CheckIncludeFiles.c.o   -c /home/john/build/CMakeFiles/CMakeTmp/CheckIncludeFiles.c
/home/john/build/CMakeFiles/CMakeTmp/CheckIncludeFiles.c:2:31: fatal error: dispatch/dispatch.h: No such file or directory
compilation terminated.
CMakeFiles/cmTC_72455.dir/build.make:65: recipe for target 'CMakeFiles/cmTC_72455.dir/CheckIncludeFiles.c.o' failed
make[1]: *** [CMakeFiles/cmTC_72455.dir/CheckIncludeFiles.c.o] Error 1
make[1]: Leaving directory '/home/john/build/CMakeFiles/CMakeTmp'
Makefile:126: recipe for target 'cmTC_72455/fast' failed
make: *** [cmTC_72455/fast] Error 2

Source:
/* */
#include <dispatch/dispatch.h>


int main(void){return 0;}

Determining if the include file sstream.h exists failed with the following output:
Change Dir: /home/john/build/CMakeFiles/CMakeTmp

Run Build Command:"/usr/bin/make" "cmTC_f33f7/fast"
/usr/bin/make -f CMakeFiles/cmTC_f33f7.dir/build.make CMakeFiles/cmTC_f33f7.dir/build
make[1]: Entering directory '/home/john/build/CMakeFiles/CMakeTmp'
Building CXX object CMakeFiles/cmTC_f33f7.dir/CheckIncludeFile.cxx.o
/usr/bin/c++      -o CMakeFiles/cmTC_f33f7.dir/CheckIncludeFile.cxx.o -c /home/john/build/CMakeFiles/CMakeTmp/CheckIncludeFile.cxx
/home/john/build/CMakeFiles/CMakeTmp/CheckIncludeFile.cxx:1:21: fatal error: sstream.h: No such file or directory
compilation terminated.
CMakeFiles/cmTC_f33f7.dir/build.make:65: recipe for target 'CMakeFiles/cmTC_f33f7.dir/CheckIncludeFile.cxx.o' failed
make[1]: *** [CMakeFiles/cmTC_f33f7.dir/CheckIncludeFile.cxx.o] Error 1
make[1]: Leaving directory '/home/john/build/CMakeFiles/CMakeTmp'
Makefile:126: recipe for target 'cmTC_f33f7/fast' failed
make: *** [cmTC_f33f7/fast] Error 2


Determining if the include file strstrea.h exists failed with the following output:
Change Dir: /home/john/build/CMakeFiles/CMakeTmp

Run Build Command:"/usr/bin/make" "cmTC_0bdf8/fast"
/usr/bin/make -f CMakeFiles/cmTC_0bdf8.dir/build.make CMakeFiles/cmTC_0bdf8.dir/build
make[1]: Entering directory '/home/john/build/CMakeFiles/CMakeTmp'
Building CXX object CMakeFiles/cmTC_0bdf8.dir/CheckIncludeFile.cxx.o
/usr/bin/c++      -o CMakeFiles/cmTC_0bdf8.dir/CheckIncludeFile.cxx.o -c /home/john/build/CMakeFiles/CMakeTmp/CheckIncludeFile.cxx
/home/john/build/CMakeFiles/CMakeTmp/CheckIncludeFile.cxx:1:22: fatal error: strstrea.h: No such file or directory
compilation terminated.
CMakeFiles/cmTC_0bdf8.dir/build.make:65: recipe for target 'CMakeFiles/cmTC_0bdf8.dir/CheckIncludeFile.cxx.o' failed
make[1]: *** [CMakeFiles/cmTC_0bdf8.dir/CheckIncludeFile.cxx.o] Error 1
make[1]: Leaving directory '/home/john/build/CMakeFiles/CMakeTmp'
Makefile:126: recipe for target 'cmTC_0bdf8/fast' failed
make: *** [cmTC_0bdf8/fast] Error 2


Determining if the include file strstream.h exists failed with the following output:
Change Dir: /home/john/build/CMakeFiles/CMakeTmp

Run Build Command:"/usr/bin/make" "cmTC_c1784/fast"
/usr/bin/make -f CMakeFiles/cmTC_c1784.dir/build.make CMakeFiles/cmTC_c1784.dir/build
make[1]: Entering directory '/home/john/build/CMakeFiles/CMakeTmp'
Building CXX object CMakeFiles/cmTC_c1784.dir/CheckIncludeFile.cxx.o
/usr/bin/c++      -o CMakeFiles/cmTC_c1784.dir/CheckIncludeFile.cxx.o -c /home/john/build/CMakeFiles/CMakeTmp/CheckIncludeFile.cxx
/home/john/build/CMakeFiles/CMakeTmp/CheckIncludeFile.cxx:1:23: fatal error: strstream.h: No such file or directory
compilation terminated.
CMakeFiles/cmTC_c1784.dir/build.make:65: recipe for target 'CMakeFiles/cmTC_c1784.dir/CheckIncludeFile.cxx.o' failed
make[1]: *** [CMakeFiles/cmTC_c1784.dir/CheckIncludeFile.cxx.o] Error 1
make[1]: Leaving directory '/home/john/build/CMakeFiles/CMakeTmp'
Makefile:126: recipe for target 'cmTC_c1784/fast' failed
make: *** [cmTC_c1784/fast] Error 2


Determining if the include file fstream.h exists failed with the following output:
Change Dir: /home/john/build/CMakeFiles/CMakeTmp

Run Build Command:"/usr/bin/make" "cmTC_b6282/fast"
/usr/bin/make -f CMakeFiles/cmTC_b6282.dir/build.make CMakeFiles/cmTC_b6282.dir/build
make[1]: Entering directory '/home/john/build/CMakeFiles/CMakeTmp'
Building CXX object CMakeFiles/cmTC_b6282.dir/CheckIncludeFile.cxx.o
/usr/bin/c++      -o CMakeFiles/cmTC_b6282.dir/CheckIncludeFile.cxx.o -c /home/john/build/CMakeFiles/CMakeTmp/CheckIncludeFile.cxx
/home/john/build/CMakeFiles/CMakeTmp/CheckIncludeFile.cxx:1:21: fatal error: fstream.h: No such file or directory
compilation terminated.
CMakeFiles/cmTC_b6282.dir/build.make:65: recipe for target 'CMakeFiles/cmTC_b6282.dir/CheckIncludeFile.cxx.o' failed
make[1]: *** [CMakeFiles/cmTC_b6282.dir/CheckIncludeFile.cxx.o] Error 1
make[1]: Leaving directory '/home/john/build/CMakeFiles/CMakeTmp'
Makefile:126: recipe for target 'cmTC_b6282/fast' failed
make: *** [cmTC_b6282/fast] Error 2


Determining if the include file iomanip.h exists failed with the following output:
Change Dir: /home/john/build/CMakeFiles/CMakeTmp

Run Build Command:"/usr/bin/make" "cmTC_2982e/fast"
/usr/bin/make -f CMakeFiles/cmTC_2982e.dir/build.make CMakeFiles/cmTC_2982e.dir/build
make[1]: Entering directory '/home/john/build/CMakeFiles/CMakeTmp'
Building CXX object CMakeFiles/cmTC_2982e.dir/CheckIncludeFile.cxx.o
/usr/bin/c++      -o CMakeFiles/cmTC_2982e.dir/CheckIncludeFile.cxx.o -c /home/john/build/CMakeFiles/CMakeTmp/CheckIncludeFile.cxx
/home/john/build/CMakeFiles/CMakeTmp/CheckIncludeFile.cxx:1:21: fatal error: iomanip.h: No such file or directory
compilation terminated.
CMakeFiles/cmTC_2982e.dir/build.make:65: recipe for target 'CMakeFiles/cmTC_2982e.dir/CheckIncludeFile.cxx.o' failed
make[1]: *** [CMakeFiles/cmTC_2982e.dir/CheckIncludeFile.cxx.o] Error 1
make[1]: Leaving directory '/home/john/build/CMakeFiles/CMakeTmp'
Makefile:126: recipe for target 'cmTC_2982e/fast' failed
make: *** [cmTC_2982e/fast] Error 2


Determining if the include file iostream.h exists failed with the following output:
Change Dir: /home/john/build/CMakeFiles/CMakeTmp

Run Build Command:"/usr/bin/make" "cmTC_fa84e/fast"
/usr/bin/make -f CMakeFiles/cmTC_fa84e.dir/build.make CMakeFiles/cmTC_fa84e.dir/build
make[1]: Entering directory '/home/john/build/CMakeFiles/CMakeTmp'
Building CXX object CMakeFiles/cmTC_fa84e.dir/CheckIncludeFile.cxx.o
/usr/bin/c++      -o CMakeFiles/cmTC_fa84e.dir/CheckIncludeFile.cxx.o -c /home/john/build/CMakeFiles/CMakeTmp/CheckIncludeFile.cxx
/home/john/build/CMakeFiles/CMakeTmp/CheckIncludeFile.cxx:1:22: fatal error: iostream.h: No such file or directory
compilation terminated.
CMakeFiles/cmTC_fa84e.dir/build.make:65: recipe for target 'CMakeFiles/cmTC_fa84e.dir/CheckIncludeFile.cxx.o' failed
make[1]: *** [CMakeFiles/cmTC_fa84e.dir/CheckIncludeFile.cxx.o] Error 1
make[1]: Leaving directory '/home/john/build/CMakeFiles/CMakeTmp'
Makefile:126: recipe for target 'cmTC_fa84e/fast' failed
make: *** [cmTC_fa84e/fast] Error 2


Determining if the include file io.h exists failed with the following output:
Change Dir: /home/john/build/CMakeFiles/CMakeTmp

Run Build Command:"/usr/bin/make" "cmTC_3a35d/fast"
/usr/bin/make -f CMakeFiles/cmTC_3a35d.dir/build.make CMakeFiles/cmTC_3a35d.dir/build
make[1]: Entering directory '/home/john/build/CMakeFiles/CMakeTmp'
Building CXX object CMakeFiles/cmTC_3a35d.dir/CheckIncludeFile.cxx.o
/usr/bin/c++      -o CMakeFiles/cmTC_3a35d.dir/CheckIncludeFile.cxx.o -c /home/john/build/CMakeFiles/CMakeTmp/CheckIncludeFile.cxx
/home/john/build/CMakeFiles/CMakeTmp/CheckIncludeFile.cxx:1:16: fatal error: io.h: No such file or directory
compilation terminated.
CMakeFiles/cmTC_3a35d.dir/build.make:65: recipe for target 'CMakeFiles/cmTC_3a35d.dir/CheckIncludeFile.cxx.o' failed
make[1]: *** [CMakeFiles/cmTC_3a35d.dir/CheckIncludeFile.cxx.o] Error 1
make[1]: Leaving directory '/home/john/build/CMakeFiles/CMakeTmp'
Makefile:126: recipe for target 'cmTC_3a35d/fast' failed
make: *** [cmTC_3a35d/fast] Error 2


Determining if the include file libc.h exists failed with the following output:
Change Dir: /home/john/build/CMakeFiles/CMakeTmp

Run Build Command:"/usr/bin/make" "cmTC_cd7d3/fast"
/usr/bin/make -f CMakeFiles/cmTC_cd7d3.dir/build.make CMakeFiles/cmTC_cd7d3.dir/build
make[1]: Entering directory '/home/john/build/CMakeFiles/CMakeTmp'
Building CXX object CMakeFiles/cmTC_cd7d3.dir/CheckIncludeFile.cxx.o
/usr/bin/c++      -o CMakeFiles/cmTC_cd7d3.dir/CheckIncludeFile.cxx.o -c /home/john/build/CMakeFiles/CMakeTmp/CheckIncludeFile.cxx
/home/john/build/CMakeFiles/CMakeTmp/CheckIncludeFile.cxx:1:18: fatal error: libc.h: No such file or directory
compilation terminated.
CMakeFiles/cmTC_cd7d3.dir/build.make:65: recipe for target 'CMakeFiles/cmTC_cd7d3.dir/CheckIncludeFile.cxx.o' failed
make[1]: *** [CMakeFiles/cmTC_cd7d3.dir/CheckIncludeFile.cxx.o] Error 1
make[1]: Leaving directory '/home/john/build/CMakeFiles/CMakeTmp'
Makefile:126: recipe for target 'cmTC_cd7d3/fast' failed
make: *** [cmTC_cd7d3/fast] Error 2


Determining if the include file libpng/png.h exists failed with the following output:
Change Dir: /home/john/build/CMakeFiles/CMakeTmp

Run Build Command:"/usr/bin/make" "cmTC_d012d/fast"
/usr/bin/make -f CMakeFiles/cmTC_d012d.dir/build.make CMakeFiles/cmTC_d012d.dir/build
make[1]: Entering directory '/home/john/build/CMakeFiles/CMakeTmp'
Building CXX object CMakeFiles/cmTC_d012d.dir/CheckIncludeFile.cxx.o
/usr/bin/c++      -o CMakeFiles/cmTC_d012d.dir/CheckIncludeFile.cxx.o -c /home/john/build/CMakeFiles/CMakeTmp/CheckIncludeFile.cxx
/home/john/build/CMakeFiles/CMakeTmp/CheckIncludeFile.cxx:1:24: fatal error: libpng/png.h: No such file or directory
compilation terminated.
CMakeFiles/cmTC_d012d.dir/build.make:65: recipe for target 'CMakeFiles/cmTC_d012d.dir/CheckIncludeFile.cxx.o' failed
make[1]: *** [CMakeFiles/cmTC_d012d.dir/CheckIncludeFile.cxx.o] Error 1
make[1]: Leaving directory '/home/john/build/CMakeFiles/CMakeTmp'
Makefile:126: recipe for target 'cmTC_d012d/fast' failed
make: *** [cmTC_d012d/fast] Error 2


Determining if the include file new.h exists failed with the following output:
Change Dir: /home/john/build/CMakeFiles/CMakeTmp

Run Build Command:"/usr/bin/make" "cmTC_21530/fast"
/usr/bin/make -f CMakeFiles/cmTC_21530.dir/build.make CMakeFiles/cmTC_21530.dir/build
make[1]: Entering directory '/home/john/build/CMakeFiles/CMakeTmp'
Building CXX object CMakeFiles/cmTC_21530.dir/CheckIncludeFile.cxx.o
/usr/bin/c++      -o CMakeFiles/cmTC_21530.dir/CheckIncludeFile.cxx.o -c /home/john/build/CMakeFiles/CMakeTmp/CheckIncludeFile.cxx
/home/john/build/CMakeFiles/CMakeTmp/CheckIncludeFile.cxx:1:17: fatal error: new.h: No such file or directory
compilation terminated.
CMakeFiles/cmTC_21530.dir/build.make:65: recipe for target 'CMakeFiles/cmTC_21530.dir/CheckIncludeFile.cxx.o' failed
make[1]: *** [CMakeFiles/cmTC_21530.dir/CheckIncludeFile.cxx.o] Error 1
make[1]: Leaving directory '/home/john/build/CMakeFiles/CMakeTmp'
Makefile:126: recipe for target 'cmTC_21530/fast' failed
make: *** [cmTC_21530/fast] Error 2


Determining if the include file stat.h exists failed with the following output:
Change Dir: /home/john/build/CMakeFiles/CMakeTmp

Run Build Command:"/usr/bin/make" "cmTC_e1ed8/fast"
/usr/bin/make -f CMakeFiles/cmTC_e1ed8.dir/build.make CMakeFiles/cmTC_e1ed8.dir/build
make[1]: Entering directory '/home/john/build/CMakeFiles/CMakeTmp'
Building CXX object CMakeFiles/cmTC_e1ed8.dir/CheckIncludeFile.cxx.o
/usr/bin/c++      -o CMakeFiles/cmTC_e1ed8.dir/CheckIncludeFile.cxx.o -c /home/john/build/CMakeFiles/CMakeTmp/CheckIncludeFile.cxx
/home/john/build/CMakeFiles/CMakeTmp/CheckIncludeFile.cxx:1:18: fatal error: stat.h: No such file or directory
compilation terminated.
CMakeFiles/cmTC_e1ed8.dir/build.make:65: recipe for target 'CMakeFiles/cmTC_e1ed8.dir/CheckIncludeFile.cxx.o' failed
make[1]: *** [CMakeFiles/cmTC_e1ed8.dir/CheckIncludeFile.cxx.o] Error 1
make[1]: Leaving directory '/home/john/build/CMakeFiles/CMakeTmp'
Makefile:126: recipe for target 'cmTC_e1ed8/fast' failed
make: *** [cmTC_e1ed8/fast] Error 2


Determining if the include file synch.h exists failed with the following output:
Change Dir: /home/john/build/CMakeFiles/CMakeTmp

Run Build Command:"/usr/bin/make" "cmTC_cef11/fast"
/usr/bin/make -f CMakeFiles/cmTC_cef11.dir/build.make CMakeFiles/cmTC_cef11.dir/build
make[1]: Entering directory '/home/john/build/CMakeFiles/CMakeTmp'
Building CXX object CMakeFiles/cmTC_cef11.dir/CheckIncludeFile.cxx.o
/usr/bin/c++      -o CMakeFiles/cmTC_cef11.dir/CheckIncludeFile.cxx.o -c /home/john/build/CMakeFiles/CMakeTmp/CheckIncludeFile.cxx
/home/john/build/CMakeFiles/CMakeTmp/CheckIncludeFile.cxx:1:19: fatal error: synch.h: No such file or directory
compilation terminated.
CMakeFiles/cmTC_cef11.dir/build.make:65: recipe for target 'CMakeFiles/cmTC_cef11.dir/CheckIncludeFile.cxx.o' failed
make[1]: *** [CMakeFiles/cmTC_cef11.dir/CheckIncludeFile.cxx.o] Error 1
make[1]: Leaving directory '/home/john/build/CMakeFiles/CMakeTmp'
Makefile:126: recipe for target 'cmTC_cef11/fast' failed
make: *** [cmTC_cef11/fast] Error 2


Determining if the include file sys/utime.h exists failed with the following output:
Change Dir: /home/john/build/CMakeFiles/CMakeTmp

Run Build Command:"/usr/bin/make" "cmTC_8f352/fast"
/usr/bin/make -f CMakeFiles/cmTC_8f352.dir/build.make CMakeFiles/cmTC_8f352.dir/build
make[1]: Entering directory '/home/john/build/CMakeFiles/CMakeTmp'
Building CXX object CMakeFiles/cmTC_8f352.dir/CheckIncludeFile.cxx.o
/usr/bin/c++      -o CMakeFiles/cmTC_8f352.dir/CheckIncludeFile.cxx.o -c /home/john/build/CMakeFiles/CMakeTmp/CheckIncludeFile.cxx
/home/john/build/CMakeFiles/CMakeTmp/CheckIncludeFile.cxx:1:23: fatal error: sys/utime.h: No such file or directory
compilation terminated.
CMakeFiles/cmTC_8f352.dir/build.make:65: recipe for target 'CMakeFiles/cmTC_8f352.dir/CheckIncludeFile.cxx.o' failed
make[1]: *** [CMakeFiles/cmTC_8f352.dir/CheckIncludeFile.cxx.o] Error 1
make[1]: Leaving directory '/home/john/build/CMakeFiles/CMakeTmp'
Makefile:126: recipe for target 'cmTC_8f352/fast' failed
make: *** [cmTC_8f352/fast] Error 2


Determining if the include file thread.h exists failed with the following output:
Change Dir: /home/john/build/CMakeFiles/CMakeTmp

Run Build Command:"/usr/bin/make" "cmTC_19de7/fast"
/usr/bin/make -f CMakeFiles/cmTC_19de7.dir/build.make CMakeFiles/cmTC_19de7.dir/build
make[1]: Entering directory '/home/john/build/CMakeFiles/CMakeTmp'
Building CXX object CMakeFiles/cmTC_19de7.dir/CheckIncludeFile.cxx.o
/usr/bin/c++      -o CMakeFiles/cmTC_19de7.dir/CheckIncludeFile.cxx.o -c /home/john/build/CMakeFiles/CMakeTmp/CheckIncludeFile.cxx
/home/john/build/CMakeFiles/CMakeTmp/CheckIncludeFile.cxx:1:20: fatal error: thread.h: No such file or directory
compilation terminated.
CMakeFiles/cmTC_19de7.dir/build.make:65: recipe for target 'CMakeFiles/cmTC_19de7.dir/CheckIncludeFile.cxx.o' failed
make[1]: *** [CMakeFiles/cmTC_19de7.dir/CheckIncludeFile.cxx.o] Error 1
make[1]: Leaving directory '/home/john/build/CMakeFiles/CMakeTmp'
Makefile:126: recipe for target 'cmTC_19de7/fast' failed
make: *** [cmTC_19de7/fast] Error 2


Determining if the include file unix.h exists failed with the following output:
Change Dir: /home/john/build/CMakeFiles/CMakeTmp

Run Build Command:"/usr/bin/make" "cmTC_25a6b/fast"
/usr/bin/make -f CMakeFiles/cmTC_25a6b.dir/build.make CMakeFiles/cmTC_25a6b.dir/build
make[1]: Entering directory '/home/john/build/CMakeFiles/CMakeTmp'
Building CXX object CMakeFiles/cmTC_25a6b.dir/CheckIncludeFile.cxx.o
/usr/bin/c++      -o CMakeFiles/cmTC_25a6b.dir/CheckIncludeFile.cxx.o -c /home/john/build/CMakeFiles/CMakeTmp/CheckIncludeFile.cxx
/home/john/build/CMakeFiles/CMakeTmp/CheckIncludeFile.cxx:1:18: fatal error: unix.h: No such file or directory
compilation terminated.
CMakeFiles/cmTC_25a6b.dir/build.make:65: recipe for target 'CMakeFiles/cmTC_25a6b.dir/CheckIncludeFile.cxx.o' failed
make[1]: *** [CMakeFiles/cmTC_25a6b.dir/CheckIncludeFile.cxx.o] Error 1
make[1]: Leaving directory '/home/john/build/CMakeFiles/CMakeTmp'
Makefile:126: recipe for target 'cmTC_25a6b/fast' failed
make: *** [cmTC_25a6b/fast] Error 2


Determining if the function itoa exists failed with the following output:
Change Dir: /home/john/build/CMakeFiles/CMakeTmp

Run Build Command:"/usr/bin/make" "cmTC_a8c36/fast"
/usr/bin/make -f CMakeFiles/cmTC_a8c36.dir/build.make CMakeFiles/cmTC_a8c36.dir/build
make[1]: Entering directory '/home/john/build/CMakeFiles/CMakeTmp'
Building C object CMakeFiles/cmTC_a8c36.dir/CheckFunctionExists.c.o
/usr/bin/cc    -DCHECK_FUNCTION_EXISTS=itoa   -o CMakeFiles/cmTC_a8c36.dir/CheckFunctionExists.c.o   -c /usr/share/cmake-3.5/Modules/CheckFunctionExists.c
Linking C executable cmTC_a8c36
/usr/bin/cmake -E cmake_link_script CMakeFiles/cmTC_a8c36.dir/link.txt --verbose=1
/usr/bin/cc   -DCHECK_FUNCTION_EXISTS=itoa    CMakeFiles/cmTC_a8c36.dir/CheckFunctionExists.c.o  -o cmTC_a8c36 -rdynamic 
CMakeFiles/cmTC_a8c36.dir/CheckFunctionExists.c.o: In function `main':
CheckFunctionExists.c:(.text+0x15): undefined reference to `itoa'
collect2: error: ld returned 1 exit status
CMakeFiles/cmTC_a8c36.dir/build.make:97: recipe for target 'cmTC_a8c36' failed
make[1]: *** [cmTC_a8c36] Error 1
make[1]: Leaving directory '/home/john/build/CMakeFiles/CMakeTmp'
Makefile:126: recipe for target 'cmTC_a8c36/fast' failed
make: *** [cmTC_a8c36/fast] Error 2


Determining if the function malloc_debug exists failed with the following output:
Change Dir: /home/john/build/CMakeFiles/CMakeTmp

Run Build Command:"/usr/bin/make" "cmTC_8d780/fast"
/usr/bin/make -f CMakeFiles/cmTC_8d780.dir/build.make CMakeFiles/cmTC_8d780.dir/build
make[1]: Entering directory '/home/john/build/CMakeFiles/CMakeTmp'
Building C object CMakeFiles/cmTC_8d780.dir/CheckFunctionExists.c.o
/usr/bin/cc    -DCHECK_FUNCTION_EXISTS=malloc_debug   -o CMakeFiles/cmTC_8d780.dir/CheckFunctionExists.c.o   -c /usr/share/cmake-3.5/Modules/CheckFunctionExists.c
Linking C executable cmTC_8d780
/usr/bin/cmake -E cmake_link_script CMakeFiles/cmTC_8d780.dir/link.txt --verbose=1
/usr/bin/cc   -DCHECK_FUNCTION_EXISTS=malloc_debug    CMakeFiles/cmTC_8d780.dir/CheckFunctionExists.c.o  -o cmTC_8d780 -rdynamic 
CMakeFiles/cmTC_8d780.dir/CheckFunctionExists.c.o: In function `main':
CheckFunctionExists.c:(.text+0x15): undefined reference to `malloc_debug'
collect2: error: ld returned 1 exit status
CMakeFiles/cmTC_8d780.dir/build.make:97: recipe for target 'cmTC_8d780' failed
make[1]: *** [cmTC_8d780] Error 1
make[1]: Leaving directory '/home/john/build/CMakeFiles/CMakeTmp'
Makefile:126: recipe for target 'cmTC_8d780/fast' failed
make: *** [cmTC_8d780/fast] Error 2


Determining if the function strlcat exists failed with the following output:
Change Dir: /home/john/build/CMakeFiles/CMakeTmp

Run Build Command:"/usr/bin/make" "cmTC_31325/fast"
/usr/bin/make -f CMakeFiles/cmTC_31325.dir/build.make CMakeFiles/cmTC_31325.dir/build
make[1]: Entering directory '/home/john/build/CMakeFiles/CMakeTmp'
Building C object CMakeFiles/cmTC_31325.dir/CheckFunctionExists.c.o
/usr/bin/cc    -DCHECK_FUNCTION_EXISTS=strlcat   -o CMakeFiles/cmTC_31325.dir/CheckFunctionExists.c.o   -c /usr/share/cmake-3.5/Modules/CheckFunctionExists.c
Linking C executable cmTC_31325
/usr/bin/cmake -E cmake_link_script CMakeFiles/cmTC_31325.dir/link.txt --verbose=1
/usr/bin/cc   -DCHECK_FUNCTION_EXISTS=strlcat    CMakeFiles/cmTC_31325.dir/CheckFunctionExists.c.o  -o cmTC_31325 -rdynamic 
CMakeFiles/cmTC_31325.dir/CheckFunctionExists.c.o: In function `main':
CheckFunctionExists.c:(.text+0x15): undefined reference to `strlcat'
collect2: error: ld returned 1 exit status
CMakeFiles/cmTC_31325.dir/build.make:97: recipe for target 'cmTC_31325' failed
make[1]: *** [cmTC_31325] Error 1
make[1]: Leaving directory '/home/john/build/CMakeFiles/CMakeTmp'
Makefile:126: recipe for target 'cmTC_31325/fast' failed
make: *** [cmTC_31325/fast] Error 2


Determining if the function strlcpy exists failed with the following output:
Change Dir: /home/john/build/CMakeFiles/CMakeTmp

Run Build Command:"/usr/bin/make" "cmTC_5295a/fast"
/usr/bin/make -f CMakeFiles/cmTC_5295a.dir/build.make CMakeFiles/cmTC_5295a.dir/build
make[1]: Entering directory '/home/john/build/CMakeFiles/CMakeTmp'
Building C object CMakeFiles/cmTC_5295a.dir/CheckFunctionExists.c.o
/usr/bin/cc    -DCHECK_FUNCTION_EXISTS=strlcpy   -o CMakeFiles/cmTC_5295a.dir/CheckFunctionExists.c.o   -c /usr/share/cmake-3.5/Modules/CheckFunctionExists.c
Linking C executable cmTC_5295a
/usr/bin/cmake -E cmake_link_script CMakeFiles/cmTC_5295a.dir/link.txt --verbose=1
/usr/bin/cc   -DCHECK_FUNCTION_EXISTS=strlcpy    CMakeFiles/cmTC_5295a.dir/CheckFunctionExists.c.o  -o cmTC_5295a -rdynamic 
CMakeFiles/cmTC_5295a.dir/CheckFunctionExists.c.o: In function `main':
CheckFunctionExists.c:(.text+0x15): undefined reference to `strlcpy'
collect2: error: ld returned 1 exit status
CMakeFiles/cmTC_5295a.dir/build.make:97: recipe for target 'cmTC_5295a' failed
make[1]: *** [cmTC_5295a] Error 1
make[1]: Leaving directory '/home/john/build/CMakeFiles/CMakeTmp'
Makefile:126: recipe for target 'cmTC_5295a/fast' failed
make: *** [cmTC_5295a/fast] Error 2


Determining if the function _findfirst exists failed with the following output:
Change Dir: /home/john/build/CMakeFiles/CMakeTmp

Run Build Command:"/usr/bin/make" "cmTC_3da81/fast"
/usr/bin/make -f CMakeFiles/cmTC_3da81.dir/build.make CMakeFiles/cmTC_3da81.dir/build
make[1]: Entering directory '/home/john/build/CMakeFiles/CMakeTmp'
Building C object CMakeFiles/cmTC_3da81.dir/CheckFunctionExists.c.o
/usr/bin/cc    -DCHECK_FUNCTION_EXISTS=_findfirst   -o CMakeFiles/cmTC_3da81.dir/CheckFunctionExists.c.o   -c /usr/share/cmake-3.5/Modules/CheckFunctionExists.c
Linking C executable cmTC_3da81
/usr/bin/cmake -E cmake_link_script CMakeFiles/cmTC_3da81.dir/link.txt --verbose=1
/usr/bin/cc   -DCHECK_FUNCTION_EXISTS=_findfirst    CMakeFiles/cmTC_3da81.dir/CheckFunctionExists.c.o  -o cmTC_3da81 -rdynamic 
CMakeFiles/cmTC_3da81.dir/CheckFunctionExists.c.o: In function `main':
CheckFunctionExists.c:(.text+0x15): undefined reference to `_findfirst'
collect2: error: ld returned 1 exit status
CMakeFiles/cmTC_3da81.dir/build.make:97: recipe for target 'cmTC_3da81' failed
make[1]: *** [cmTC_3da81] Error 1
make[1]: Leaving directory '/home/john/build/CMakeFiles/CMakeTmp'
Makefile:126: recipe for target 'cmTC_3da81/fast' failed
make: *** [cmTC_3da81/fast] Error 2


Determining if the function std::_vfprintf exists failed with the following output:
Change Dir: /home/john/build/CMakeFiles/CMakeTmp

Run Build Command:"/usr/bin/make" "cmTC_71426/fast"
/usr/bin/make -f CMakeFiles/cmTC_71426.dir/build.make CMakeFiles/cmTC_71426.dir/build
make[1]: Entering directory '/home/john/build/CMakeFiles/CMakeTmp'
Building C object CMakeFiles/cmTC_71426.dir/CheckFunctionExists.c.o
/usr/bin/cc    -DCHECK_FUNCTION_EXISTS=std::_vfprintf   -o CMakeFiles/cmTC_71426.dir/CheckFunctionExists.c.o   -c /usr/share/cmake-3.5/Modules/CheckFunctionExists.c
<command-line>:0:26: error: expected ‘=’, ‘,’, ‘;’, ‘asm’ or ‘__attribute__’ before ‘:’ token
/usr/share/cmake-3.5/Modules/CheckFunctionExists.c:6:6: note: in expansion of macro ‘CHECK_FUNCTION_EXISTS’
 char CHECK_FUNCTION_EXISTS();
      ^
/usr/share/cmake-3.5/Modules/CheckFunctionExists.c: In function ‘main’:
<command-line>:0:27: error: expected expression before ‘:’ token
/usr/share/cmake-3.5/Modules/CheckFunctionExists.c:14:3: note: in expansion of macro ‘CHECK_FUNCTION_EXISTS’
   CHECK_FUNCTION_EXISTS();
   ^
CMakeFiles/cmTC_71426.dir/build.make:65: recipe for target 'CMakeFiles/cmTC_71426.dir/CheckFunctionExists.c.o' failed
make[1]: *** [CMakeFiles/cmTC_71426.dir/CheckFunctionExists.c.o] Error 1
make[1]: Leaving directory '/home/john/build/CMakeFiles/CMakeTmp'
Makefile:126: recipe for target 'cmTC_71426/fast' failed
make: *** [cmTC_71426/fast] Error 2


Determining if the function stdncasecmp exists failed with the following output:
Change Dir: /home/john/build/CMakeFiles/CMakeTmp

Run Build Command:"/usr/bin/make" "cmTC_c7d60/fast"
/usr/bin/make -f CMakeFiles/cmTC_c7d60.dir/build.make CMakeFiles/cmTC_c7d60.dir/build
make[1]: Entering directory '/home/john/build/CMakeFiles/CMakeTmp'
Building C object CMakeFiles/cmTC_c7d60.dir/CheckFunctionExists.c.o
/usr/bin/cc    -DCHECK_FUNCTION_EXISTS=stdncasecmp   -o CMakeFiles/cmTC_c7d60.dir/CheckFunctionExists.c.o   -c /usr/share/cmake-3.5/Modules/CheckFunctionExists.c
Linking C executable cmTC_c7d60
/usr/bin/cmake -E cmake_link_script CMakeFiles/cmTC_c7d60.dir/link.txt --verbose=1
/usr/bin/cc   -DCHECK_FUNCTION_EXISTS=stdncasecmp    CMakeFiles/cmTC_c7d60.dir/CheckFunctionExists.c.o  -o cmTC_c7d60 -rdynamic 
CMakeFiles/cmTC_c7d60.dir/CheckFunctionExists.c.o: In function `main':
CheckFunctionExists.c:(.text+0x15): undefined reference to `stdncasecmp'
collect2: error: ld returned 1 exit status
CMakeFiles/cmTC_c7d60.dir/build.make:97: recipe for target 'cmTC_c7d60' failed
make[1]: *** [cmTC_c7d60] Error 1
make[1]: Leaving directory '/home/john/build/CMakeFiles/CMakeTmp'
Makefile:126: recipe for target 'cmTC_c7d60/fast' failed
make: *** [cmTC_c7d60/fast] Error 2


Determining if the function _stricmp exists failed with the following output:
Change Dir: /home/john/build/CMakeFiles/CMakeTmp

Run Build Command:"/usr/bin/make" "cmTC_73eb5/fast"
/usr/bin/make -f CMakeFiles/cmTC_73eb5.dir/build.make CMakeFiles/cmTC_73eb5.dir/build
make[1]: Entering directory '/home/john/build/CMakeFiles/CMakeTmp'
Building C object CMakeFiles/cmTC_73eb5.dir/CheckFunctionExists.c.o
/usr/bin/cc    -DCHECK_FUNCTION_EXISTS=_stricmp   -o CMakeFiles/cmTC_73eb5.dir/CheckFunctionExists.c.o   -c /usr/share/cmake-3.5/Modules/CheckFunctionExists.c
Linking C executable cmTC_73eb5
/usr/bin/cmake -E cmake_link_script CMakeFiles/cmTC_73eb5.dir/link.txt --verbose=1
/usr/bin/cc   -DCHECK_FUNCTION_EXISTS=_stricmp    CMakeFiles/cmTC_73eb5.dir/CheckFunctionExists.c.o  -o cmTC_73eb5 -rdynamic 
CMakeFiles/cmTC_73eb5.dir/CheckFunctionExists.c.o: In function `main':
CheckFunctionExists.c:(.text+0x15): undefined reference to `_stricmp'
collect2: error: ld returned 1 exit status
CMakeFiles/cmTC_73eb5.dir/build.make:97: recipe for target 'cmTC_73eb5' failed
make[1]: *** [cmTC_73eb5] Error 1
make[1]: Leaving directory '/home/john/build/CMakeFiles/CMakeTmp'
Makefile:126: recipe for target 'cmTC_73eb5/fast' failed
make: *** [cmTC_73eb5/fast] Error 2


Determining size of uchar failed with the following output:
Change Dir: /home/john/build/CMakeFiles/CMakeTmp

Run Build Command:"/usr/bin/make" "cmTC_0d989/fast"
/usr/bin/make -f CMakeFiles/cmTC_0d989.dir/build.make CMakeFiles/cmTC_0d989.dir/build
make[1]: Entering directory '/home/john/build/CMakeFiles/CMakeTmp'
Building C object CMakeFiles/cmTC_0d989.dir/SYS_TYPES_UCHAR.c.o
/usr/bin/cc     -o CMakeFiles/cmTC_0d989.dir/SYS_TYPES_UCHAR.c.o   -c /home/john/build/CMakeFiles/CheckTypeSize/SYS_TYPES_UCHAR.c
/home/john/build/CMakeFiles/CheckTypeSize/SYS_TYPES_UCHAR.c:18:22: error: ‘uchar’ undeclared here (not in a function)
 #define SIZE (sizeof(uchar))
                      ^
/home/john/build/CMakeFiles/CheckTypeSize/SYS_TYPES_UCHAR.c:20:12: note: in expansion of macro ‘SIZE’
   ('0' + ((SIZE / 10000)%10)),
            ^
CMakeFiles/cmTC_0d989.dir/build.make:65: recipe for target 'CMakeFiles/cmTC_0d989.dir/SYS_TYPES_UCHAR.c.o' failed
make[1]: *** [CMakeFiles/cmTC_0d989.dir/SYS_TYPES_UCHAR.c.o] Error 1
make[1]: Leaving directory '/home/john/build/CMakeFiles/CMakeTmp'
Makefile:126: recipe for target 'cmTC_0d989/fast' failed
make: *** [cmTC_0d989/fast] Error 2

/home/john/build/CMakeFiles/CheckTypeSize/SYS_TYPES_UCHAR.c:
#include <sys/types.h>
#include <stdint.h>
#include <stddef.h>
#include "sys/types.h"


#undef KEY
#if defined(__i386)
# define KEY '_','_','i','3','8','6'
#elif defined(__x86_64)
# define KEY '_','_','x','8','6','_','6','4'
#elif defined(__ppc__)
# define KEY '_','_','p','p','c','_','_'
#elif defined(__ppc64__)
# define KEY '_','_','p','p','c','6','4','_','_'
#endif

#define SIZE (sizeof(uchar))
char info_size[] =  {'I', 'N', 'F', 'O', ':', 's','i','z','e','[',
  ('0' + ((SIZE / 10000)%10)),
  ('0' + ((SIZE / 1000)%10)),
  ('0' + ((SIZE / 100)%10)),
  ('0' + ((SIZE / 10)%10)),
  ('0' +  (SIZE    % 10)),
  ']',
#ifdef KEY
  ' ','k','e','y','[', KEY, ']',
#endif
  '\0'};

#ifdef __CLASSIC_C__
int main(argc, argv) int argc; char *argv[];
#else
int main(int argc, char *argv[])
#endif
{
  int require = 0;
  require += info_size[argc];
  (void)argv;
  return require;
}


Determining if the DIR exist failed with the following output:
Change Dir: /home/john/build/CMakeFiles/CMakeTmp

Run Build Command:"/usr/bin/make" "cmTC_c4f45/fast"
/usr/bin/make -f CMakeFiles/cmTC_c4f45.dir/build.make CMakeFiles/cmTC_c4f45.dir/build
make[1]: Entering directory '/home/john/build/CMakeFiles/CMakeTmp'
Building C object CMakeFiles/cmTC_c4f45.dir/CheckSymbolExists.c.o
/usr/bin/cc     -o CMakeFiles/cmTC_c4f45.dir/CheckSymbolExists.c.o   -c /home/john/build/CMakeFiles/CMakeTmp/CheckSymbolExists.c
/home/john/build/CMakeFiles/CMakeTmp/CheckSymbolExists.c:2:18: fatal error: ndir.h: No such file or directory
compilation terminated.
CMakeFiles/cmTC_c4f45.dir/build.make:65: recipe for target 'CMakeFiles/cmTC_c4f45.dir/CheckSymbolExists.c.o' failed
make[1]: *** [CMakeFiles/cmTC_c4f45.dir/CheckSymbolExists.c.o] Error 1
make[1]: Leaving directory '/home/john/build/CMakeFiles/CMakeTmp'
Makefile:126: recipe for target 'cmTC_c4f45/fast' failed
make: *** [cmTC_c4f45/fast] Error 2

File /home/john/build/CMakeFiles/CMakeTmp/CheckSymbolExists.c:
/* */
#include <ndir.h>

int main(int argc, char** argv)
{
  (void)argv;
#ifndef DIR
  return ((int*)(&DIR))[argc];
#else
  (void)argc;
  return 0;
#endif
}

Determining if the DIR exist failed with the following output:
Change Dir: /home/john/build/CMakeFiles/CMakeTmp

Run Build Command:"/usr/bin/make" "cmTC_087de/fast"
/usr/bin/make -f CMakeFiles/cmTC_087de.dir/build.make CMakeFiles/cmTC_087de.dir/build
make[1]: Entering directory '/home/john/build/CMakeFiles/CMakeTmp'
Building C object CMakeFiles/cmTC_087de.dir/CheckSymbolExists.c.o
/usr/bin/cc     -o CMakeFiles/cmTC_087de.dir/CheckSymbolExists.c.o   -c /home/john/build/CMakeFiles/CMakeTmp/CheckSymbolExists.c
/home/john/build/CMakeFiles/CMakeTmp/CheckSymbolExists.c: In function ‘main’:
/home/john/build/CMakeFiles/CMakeTmp/CheckSymbolExists.c:8:19: error: expected expression before ‘DIR’
   return ((int*)(&DIR))[argc];
                   ^
CMakeFiles/cmTC_087de.dir/build.make:65: recipe for target 'CMakeFiles/cmTC_087de.dir/CheckSymbolExists.c.o' failed
make[1]: *** [CMakeFiles/cmTC_087de.dir/CheckSymbolExists.c.o] Error 1
make[1]: Leaving directory '/home/john/build/CMakeFiles/CMakeTmp'
Makefile:126: recipe for target 'cmTC_087de/fast' failed
make: *** [cmTC_087de/fast] Error 2

File /home/john/build/CMakeFiles/CMakeTmp/CheckSymbolExists.c:
/* */
#include <sys/dir.h>

int main(int argc, char** argv)
{
  (void)argv;
#ifndef DIR
  return ((int*)(&DIR))[argc];
#else
  (void)argc;
  return 0;
#endif
}

Determining if the DIR exist failed with the following output:
Change Dir: /home/john/build/CMakeFiles/CMakeTmp

Run Build Command:"/usr/bin/make" "cmTC_2a6c9/fast"
/usr/bin/make -f CMakeFiles/cmTC_2a6c9.dir/build.make CMakeFiles/cmTC_2a6c9.dir/build
make[1]: Entering directory '/home/john/build/CMakeFiles/CMakeTmp'
Building C object CMakeFiles/cmTC_2a6c9.dir/CheckSymbolExists.c.o
/usr/bin/cc     -o CMakeFiles/cmTC_2a6c9.dir/CheckSymbolExists.c.o   -c /home/john/build/CMakeFiles/CMakeTmp/CheckSymbolExists.c
/home/john/build/CMakeFiles/CMakeTmp/CheckSymbolExists.c:2:22: fatal error: sys/ndir.h: No such file or directory
compilation terminated.
CMakeFiles/cmTC_2a6c9.dir/build.make:65: recipe for target 'CMakeFiles/cmTC_2a6c9.dir/CheckSymbolExists.c.o' failed
make[1]: *** [CMakeFiles/cmTC_2a6c9.dir/CheckSymbolExists.c.o] Error 1
make[1]: Leaving directory '/home/john/build/CMakeFiles/CMakeTmp'
Makefile:126: recipe for target 'cmTC_2a6c9/fast' failed
make: *** [cmTC_2a6c9/fast] Error 2

File /home/john/build/CMakeFiles/CMakeTmp/CheckSymbolExists.c:
/* */
#include <sys/ndir.h>

int main(int argc, char** argv)
{
  (void)argv;
#ifndef DIR
  return ((int*)(&DIR))[argc];
#else
  (void)argc;
  return 0;
#endif
}

